Webcenter, BPM Process Spaces – UCM PS5

Blog page moved to

http://blogs.the-hindu-matrimony.com/wordpress/oracle-fusion-middleware/webcenter-and-bpm-process-spaces-ps5/

Advertisements

7 thoughts on “Webcenter, BPM Process Spaces – UCM PS5

  1. Excellent post , it would be possible for you to send me the student application form project for me to test it in my enviroment ? ? Thank you in advance.

  2. #extendSoa=true — first time
    # when u run second time
    extendSoa=false

    then run
    [james@james process_spaces]$ /home/james/Oracle/Middleware/modules/org.apache.ant_1.7.1/bin/ant -f install.xml -DpiArgs=”-importGSOnly”
    Unable to locate tools.jar. Expected to find it in /usr/lib/jvm/java-1.7.0-openjdk-1.7.0.6.x86_64/lib/tools.jar
    Buildfile: install.xml

    readPasswords:

    validate-env:
    [echo] Validating the environment..

    post-install:
    [echo] This target can also be called by setting ‘piArgs’ property for fine grained operations.
    [echo] Possible values are:
    [echo] -importRCOnly — Imports only resource catalogs and exits.
    [echo] -importGSOnly — Imports only group spaces and exits.
    [echo] -configDSOnly — Configures data sources when SOA domain is not extended
    [echo] -foreignJndiOnly — Configures foreign JNDI links
    [echo] -deploySTCOnly — deploys server test case ejb
    [echo] -all (default) — Does all post install activies including all above
    [echo] Invoking post install script with args: -importGSOnly
    [exec]

  3. How To Configure Oracle BPM 11g Process Portal on Oracle WebCenter Spaces

    When i execute a command ant -f install.xml i can see the next error

    [exec] Updating deployment targets for the datasources…
    [exec] This Exception occurred at Tue Dec 18 14:32:49 EST 2012.
    [exec] javax.management.InvalidAttributeValueException: Array has at least one null element
    [exec] Problem invoking WLST – Traceback (innermost last):
    [exec] File “/opt/oracle/Middleware/Oracle_SOA1/bpm/process_spaces/wc-post-install.py”, line 253, in ?
    [exec] File “/opt/oracle/Middleware/Oracle_SOA1/bpm/process_spaces/wc-post-install.py”, line 112, in updateTargets
    [exec] File “”, line 581, in set
    [exec] File “”, line 1847, in raiseWLSTException
    [exec] WLSTException: Error occured while performing set : Error setting attribute Targets : Array has at least one null element
    [exec] Use dumpStack() to view the full stacktrace
    [exec]

    BUILD FAILED
    /opt/oracle/Middleware/Oracle_SOA1/bpm/process_spaces/install.xml:207: exec returned: 1

    Someone know the cause of this error??
    Thanks in advance

  4. Hello, first of all thank you for sharing. And i have a questions. Why I’m getting this error.

    C:\Oracle\Middleware\Oracle_SOA1\bpm\process_spaces>C:\Oracle\Middleware\modules
    \org.apache.ant_1.7.1\bin\ant -f install.xml
    Buildfile: install.xml

    BUILD FAILED
    C:\Oracle\Middleware\Oracle_SOA1\bpm\process_spaces\install.xml:82: C:\Oracle\Mi
    ddleware\Oracle_SOA1\bpm\process_spaces\modules not found.

Leave a Reply

Fill in your details below or click an icon to log in:

WordPress.com Logo

You are commenting using your WordPress.com account. Log Out / Change )

Twitter picture

You are commenting using your Twitter account. Log Out / Change )

Facebook photo

You are commenting using your Facebook account. Log Out / Change )

Google+ photo

You are commenting using your Google+ account. Log Out / Change )

Connecting to %s